BDBM42116 2-chloranyl-4-(2,5-dimethylpyrrol-1-yl)benzoic acid::2-chloro-4-(2,5-dimethyl-1-pyrrolyl)benzoic acid::2-chloro-4-(2,5-dimethylpyrrol-1-yl)benzoic acid::BIM-0038363.P001::cid_767155
SMILES Cc1ccc(C)n1-c1ccc(C(O)=O)c(Cl)c1
InChI Key InChIKey=LNAUEAGSVLKUBO-UHFFFAOYSA-N
Data  1 EC50
  Tab Delimited (TSV)   2D SDfile   Computed 3D by Vconf -m prep SDfile
Find this compound or compounds like it in BindingDB:
Activity Spreadsheet -- Enzyme Inhibition Constant Data from BindingDB
Found 1 hit for monomerid = 42116
TargetNuclear receptor subfamily 4 group A member 1(Homo sapiens (Human))
Sanford-Burnham Center For Chemical Genomics
Curated by PubChem BioAssay
LigandPNGBDBM42116(2-chloranyl-4-(2,5-dimethylpyrrol-1-yl)benzoic aci...)
Affinity DataEC50:  9.96E+3nM. Assay description: Data Source: Sanford-Burnham Center for Chemical Genomics (SBCCG) Source Affiliation: Sanford-Burnham Medical Research Institute (SBMRI, San Diego, C...
In DepthDetails PCBioAssay