BDBM421181 7-(2-methyl-5-((3,4,6,7-tetrahydro-5H-imidazo[4,5- c]pyridin-5-yl)sulfonyl)phenyl)imidazo[2,1-f][1,2,4]triazin- 4-amine::US10479795, Example 224
SMILES Cc1ccc(cc1-c1cnc2c(N)ncnn12)S(=O)(=O)N1CCc2nc[nH]c2C1
InChI Key InChIKey=BBRRLZAFXWHETH-UHFFFAOYSA-N
Data  2 IC50
  Tab Delimited (TSV)   2D SDfile   Computed 3D by Vconf -m prep SDfile
Find this compound or compounds like it in BindingDB:
Activity Spreadsheet -- Enzyme Inhibition Constant Data from BindingDB
Found 2 hits for monomerid = 421181
LigandPNGBDBM421181(7-(2-methyl-5-((3,4,6,7-tetrahydro-5H-imidazo[4,5-...)
Affinity DataIC50: >100nM. Assay description: PI3Kδ:[γ-33P]ATP (10 mCi/mL) and Wheat Germ Agglutinin (WGA) YSi SPA Scintillation Beads was purchased from Perkin-Elmer (Waltham, Mass.). ...
Ligand Info
In DepthDetails US Patent
LigandPNGBDBM421181(7-(2-methyl-5-((3,4,6,7-tetrahydro-5H-imidazo[4,5-...)
Affinity DataIC50: <100nM. Assay description: PI3K-γ:[γ-33P]ATP (10 mCi/mL) and Wheat Germ Agglutinin (WGA) YSi SPA Scintillation Beads was purchased from Perkin-Elmer (Waltham, Mass.)....
Ligand Info
In DepthDetails US Patent