BDBM42227 2-(2-Methoxy-phenylamino)-3-piperidin-1-yl-[1,4]naphthoquinone::2-(2-methoxyanilino)-3-(1-piperidinyl)naphthalene-1,4-dione::2-(2-methoxyanilino)-3-piperidin-1-ylnaphthalene-1,4-dione::2-(o-anisidino)-3-piperidino-1,4-naphthoquinone::2-[(2-methoxyphenyl)amino]-3-piperidin-1-yl-naphthalene-1,4-dione::MLS000590461::SMR000217508::cid_1388836
SMILES COc1ccccc1NC1=C(N2CCCCC2)C(=O)c2ccccc2C1=O
InChI Key InChIKey=SKHLQEYQHYUBHY-UHFFFAOYSA-N
Data  6 IC50
  Tab Delimited (TSV)   2D SDfile   Computed 3D by Vconf -m prep SDfile
Find this compound or compounds like it in BindingDB:
Activity Spreadsheet -- Enzyme Inhibition Constant Data from BindingDB
Found 6 hits for monomerid = 42227
TargetTyrosine-protein phosphatase YopH(Yersinia enterocolitica)
University Of Pittsburgh
Curated by PubChem BioAssay
LigandPNGBDBM42227(2-(2-Methoxy-phenylamino)-3-piperidin-1-yl-[1,4]na...)
Affinity DataIC50: >5.00E+4nM. Assay description: Yersinia pestis is the causal agent of the bubonic plague and, although modern antibiotics are extremely effective against the malady, the plague rem...
In DepthDetails PCBioAssay
TargetTyrosine-protein phosphatase YopH(Yersinia enterocolitica)
University Of Pittsburgh
Curated by PubChem BioAssay
LigandPNGBDBM42227(2-(2-Methoxy-phenylamino)-3-piperidin-1-yl-[1,4]na...)
Affinity DataIC50: >5.00E+4nM. Assay description: Yersinia pestis is the causal agent of the bubonic plague and, although modern antibiotics are extremely effective against the malady, the plague rem...
In DepthDetails PCBioAssay
TargetCaspase-9(Homo sapiens (Human))
Burnham Center For Chemical Genomics
Curated by PubChem BioAssay
LigandPNGBDBM42227(2-(2-Methoxy-phenylamino)-3-piperidin-1-yl-[1,4]na...)
Affinity DataIC50:  3.21E+3nM. Assay description: Data Source: Sanford-Burnham Center for Chemical Genomics (SBCCG) Source Affiliation: Sanford-Burnham Medical Research Institute (SBIMR, San Diego, C...
In DepthDetails PCBioAssay
TargetApoptotic protease-activating factor 1(Homo sapiens (Human))
Burnham Center For Chemical Genomics
Curated by PubChem BioAssay
LigandPNGBDBM42227(2-(2-Methoxy-phenylamino)-3-piperidin-1-yl-[1,4]na...)
Affinity DataIC50:  3.32E+3nM. Assay description: Data Source: Sanford-Burnham Center for Chemical Genomics (SBCCG) Source Affiliation: Sanford-Burnham Medical Research Institute (SBIMR, San Diego, C...
In DepthDetails PCBioAssay
TargetApoptotic protease-activating factor 1(Homo sapiens (Human))
Burnham Center For Chemical Genomics
Curated by PubChem BioAssay
LigandPNGBDBM42227(2-(2-Methoxy-phenylamino)-3-piperidin-1-yl-[1,4]na...)
Affinity DataIC50: >1.00E+5nM. Assay description: Data Source: Sanford-Burnham Center for Chemical Genomics (SBCCG) Source Affiliation: Sanford-Burnham Medical Research Institute (SBIMR, San Diego, C...
In DepthDetails PCBioAssay
TargetTyrosine-protein phosphatase YopH(Yersinia enterocolitica)
University Of Pittsburgh
Curated by PubChem BioAssay
LigandPNGBDBM42227(2-(2-Methoxy-phenylamino)-3-piperidin-1-yl-[1,4]na...)
Affinity DataIC50:  4.86E+4nM. Assay description: Yersinia pestis is the causal agent of the bubonic plague and, although modern antibiotics are extremely effective against the malady, the plague rem...
In DepthDetails PCBioAssay