BDBM42234 4-[(1,4-diketo-3-morpholino-2-naphthyl)amino]benzoic acid::4-[(3-morpholin-4-yl-1,4-dioxo-1,4-dihydronaphthalen-2-yl)amino]benzoic acid::4-[(3-morpholin-4-yl-1,4-dioxonaphthalen-2-yl)amino]benzoic acid::4-[[3-(4-morpholinyl)-1,4-dioxo-2-naphthalenyl]amino]benzoic acid::4-[[3-morpholin-4-yl-1,4-bis(oxidanylidene)naphthalen-2-yl]amino]benzoic acid::MLS000585557::SMR000207538::cid_3610968
SMILES OC(=O)c1ccc(NC2=C(N3CCOCC3)C(=O)c3ccccc3C2=O)cc1
InChI Key InChIKey=GGOGASVIGCGHDI-UHFFFAOYSA-N
Data  6 IC50
  Tab Delimited (TSV)   2D SDfile   Computed 3D by Vconf -m prep SDfile
Find this compound or compounds like it in BindingDB:
Activity Spreadsheet -- Enzyme Inhibition Constant Data from BindingDB
Found 6 hits for monomerid = 42234
TargetTyrosine-protein phosphatase YopH(Yersinia enterocolitica)
University Of Pittsburgh
Curated by PubChem BioAssay
LigandPNGBDBM42234(4-[(1,4-diketo-3-morpholino-2-naphthyl)amino]benzo...)
Affinity DataIC50: >5.00E+4nM. Assay description: Yersinia pestis is the causal agent of the bubonic plague and, although modern antibiotics are extremely effective against the malady, the plague rem...
In DepthDetails PCBioAssay
TargetTyrosine-protein phosphatase YopH(Yersinia enterocolitica)
University Of Pittsburgh
Curated by PubChem BioAssay
LigandPNGBDBM42234(4-[(1,4-diketo-3-morpholino-2-naphthyl)amino]benzo...)
Affinity DataIC50: >5.00E+4nM. Assay description: Yersinia pestis is the causal agent of the bubonic plague and, although modern antibiotics are extremely effective against the malady, the plague rem...
In DepthDetails PCBioAssay
TargetCaspase-9(Homo sapiens (Human))
Burnham Center For Chemical Genomics
Curated by PubChem BioAssay
LigandPNGBDBM42234(4-[(1,4-diketo-3-morpholino-2-naphthyl)amino]benzo...)
Affinity DataIC50:  2.15E+4nM. Assay description: Data Source: Sanford-Burnham Center for Chemical Genomics (SBCCG) Source Affiliation: Sanford-Burnham Medical Research Institute (SBIMR, San Diego, C...
In DepthDetails PCBioAssay
TargetApoptotic protease-activating factor 1(Homo sapiens (Human))
Burnham Center For Chemical Genomics
Curated by PubChem BioAssay
LigandPNGBDBM42234(4-[(1,4-diketo-3-morpholino-2-naphthyl)amino]benzo...)
Affinity DataIC50:  3.58E+4nM. Assay description: Data Source: Sanford-Burnham Center for Chemical Genomics (SBCCG) Source Affiliation: Sanford-Burnham Medical Research Institute (SBIMR, San Diego, C...
In DepthDetails PCBioAssay
TargetApoptotic protease-activating factor 1(Homo sapiens (Human))
Burnham Center For Chemical Genomics
Curated by PubChem BioAssay
LigandPNGBDBM42234(4-[(1,4-diketo-3-morpholino-2-naphthyl)amino]benzo...)
Affinity DataIC50: >1.00E+5nM. Assay description: Data Source: Sanford-Burnham Center for Chemical Genomics (SBCCG) Source Affiliation: Sanford-Burnham Medical Research Institute (SBIMR, San Diego, C...
In DepthDetails PCBioAssay
TargetTyrosine-protein phosphatase YopH(Yersinia enterocolitica)
University Of Pittsburgh
Curated by PubChem BioAssay
LigandPNGBDBM42234(4-[(1,4-diketo-3-morpholino-2-naphthyl)amino]benzo...)
Affinity DataIC50: >5.00E+4nM. Assay description: Yersinia pestis is the causal agent of the bubonic plague and, although modern antibiotics are extremely effective against the malady, the plague rem...
In DepthDetails PCBioAssay