BDBM423171 US10501440, Example 3
SMILES Cc1nn(Cc2ccc(nc2C)N2CC3CC3C2)cc1C(=O)N[C@@H]1CCc2c1ccnc2N
InChI Key InChIKey=YNFHLIKBRGHMLO-RWWKDMOOSA-N
Data  1 KI  1 IC50
  Tab Delimited (TSV)   2D SDfile   Computed 3D by Vconf -m prep SDfile
Find this compound or compounds like it in BindingDB:
Activity Spreadsheet -- Enzyme Inhibition Constant Data from BindingDB
Found 2 hits for monomerid = 423171
TargetPlasma kallikrein(Homo sapiens (Human))
Boehringer Ingelheim International
US Patent
LigandPNGBDBM423171(US10501440, Example 3)
Affinity DataKi:  0.300nM. Assay description: Human KLKB1 (1.78 nM or 0.025 U/mL; Enzyme Research Laboratories) was incubated at 24° C. with 0.25 mM fluorogenic substrate H-Pro-Phe-Arg-AMC (11295...
Ligand InfoPC cidPC sid
In DepthDetails US Patent
TargetPlasma kallikrein(Rattus norvegicus)
Boehringer Ingelheim International
US Patent
LigandPNGBDBM423171(US10501440, Example 3)
Affinity DataIC50:  0.700nM. Assay description: Human KLKB1 (0.01 U/mL; Enzyme Research Laboratories) or rat KLKB1 (0.625 nM; produced in-house) was incubated for 1 h at room temperature with 0.10 ...
Ligand InfoPC cidPC sid
In DepthDetails US Patent