BDBM423428 WO2005113580-Ex-26
SMILES COc1cccc2[nH]c(cc12)C(=O)N[C@@H](CC1CCCCC1)C(=O)N[C@@H](C[C@@H]1CCNC1=O)C(=O)COCc1ccccc1
InChI Key InChIKey=XXYBEOYTBGBIIC-WIRXVTQYSA-N
Data  1 IC50  1 EC50
  Tab Delimited (TSV)   2D SDfile   Computed 3D by Vconf -m prep SDfile
Find this compound or compounds like it in BindingDB:
Activity Spreadsheet -- Enzyme Inhibition Constant Data from BindingDB
Found 2 hits for monomerid = 423428
TargetReplicase polyprotein 1ab(Human SARS coronavirus (SARS-CoV) (Severe acute re...)
Pfizer
WIPO
LigandPNGBDBM423428(WO2005113580-Ex-26)
Affinity DataEC50:  5.80E+3nM. Assay description: Protection from SARS Infection: Neutral Red Endpoint The ability of compounds to protect cells against infection by the SARS coronavirus is measured ...
Ligand InfoPC cidPC sid
In DepthDetails PubMed
TargetReplicase polyprotein 1ab(Human SARS coronavirus (SARS-CoV) (Severe acute re...)
Pfizer
WIPO
LigandPNGBDBM423428(WO2005113580-Ex-26)
Affinity DataIC50:  133nM. Assay description: The SARS 3CLpro FRET assay measures the protease catalyzed cleavage of TAMRA- SITSAVLQSGFRKMK-(DABCYL)-OH to TAMRA - SITSAVLQ and SGFRKMK- (DABCYL)-O...
Ligand InfoPC cidPC sid
In DepthDetails PubMed