BDBM423460 WO2006061714, Example 2::WO2006061714-ID-02
SMILES COc1cccc2[nH]c(cc12)C(=O)N[C@@H](CC(C)C)C(=O)N[C@H](CO)C[C@@H]1CCNC1=O
InChI Key InChIKey=WHTWOUANZWYZGR-MPGHIAIKSA-N
Data  2 EC50
PDB links: 1 PDB ID matches this monomer.
  Tab Delimited (TSV)   2D SDfile   Computed 3D by Vconf -m prep SDfile
Find this compound or compounds like it in BindingDB:
Activity Spreadsheet -- Enzyme Inhibition Constant Data from BindingDB
Found 2 hits for monomerid = 423460
TargetReplicase polyprotein 1ab(SARS coronavirus Urbani)
Pfizer
WIPO
LigandPNGBDBM423460(WO2006061714, Example 2 | WO2006061714-ID-02)
Affinity DataEC50: >1.00E+8nM. Assay description: Proteolytic activity of Coronavirus 3C protease is measured using a continuous fluorescence resonance energy transfer assay. The SARS 3CI_pro FRET as...
Ligand InfoPC cidPC sidPDB
TargetReplicase polyprotein 1ab(Human SARS coronavirus (SARS-CoV) (Severe acute re...)
Pfizer
WIPO
LigandPNGBDBM423460(WO2006061714, Example 2 | WO2006061714-ID-02)
Affinity DataEC50: >1.00E+5nM. Assay description: Protection from SARS Infection: Neutral Red Endpoint The ability of compounds to protect cells against infection by the SARS coronavirus is measured ...
Ligand InfoPC cidPC sidPDB