BDBM42380 4,6-dimethyl-7,8,9,10-tetrahydro-2H-pyrano[2,3-f]quinolin-2-one::4,6-dimethyl-7,8,9,10-tetrahydropyrano[2,3-f]quinolin-2-one::MLS000059234::SMR000069698::cid_760021
SMILES Cc1cc2c(C)cc(=O)oc2c2CCCNc12
InChI Key InChIKey=HNBLXGUKCHVXSO-UHFFFAOYSA-N
Data  1 EC50
  Tab Delimited (TSV)   2D SDfile   Computed 3D by Vconf -m prep SDfile
Find this compound or compounds like it in BindingDB:
Activity Spreadsheet -- Enzyme Inhibition Constant Data from BindingDB
Found 1 hit for monomerid = 42380
TargetLysosomal acid glucosylceramidase(Homo sapiens (Human))
The Scripps Research Institute Molecular Screening Center
Curated by PubChem BioAssay
LigandPNGBDBM42380(4,6-dimethyl-7,8,9,10-tetrahydro-2H-pyrano[2,3-f]q...)
Affinity DataEC50: >5.00E+4nM. Assay description: Source (MLSCN Center Name): The Scripps Research Institute Molecular Screening Center Center Affiliation: The Scripps Research Institute, TSRI Assay ...
In DepthDetails PCBioAssay