BDBM42399 2-(butylthio)-5-(4-methylphenyl)-1,3,4-oxadiazole::2-(butylthio)-5-(p-tolyl)-1,3,4-oxadiazole::2-butylsulfanyl-5-(4-methylphenyl)-1,3,4-oxadiazole::MLS000063529::SMR000072528::cid_2188596
SMILES CCCCSc1nnc(o1)-c1ccc(C)cc1
InChI Key InChIKey=JPAWHIGGTVOTJC-UHFFFAOYSA-N
Data  1 EC50
  Tab Delimited (TSV)   2D SDfile   Computed 3D by Vconf -m prep SDfile
Find this compound or compounds like it in BindingDB:
Activity Spreadsheet -- Enzyme Inhibition Constant Data from BindingDB
Found 1 hit for monomerid = 42399
TargetLysosomal acid glucosylceramidase(Homo sapiens (Human))
The Scripps Research Institute Molecular Screening Center
Curated by PubChem BioAssay
LigandPNGBDBM42399(2-(butylthio)-5-(4-methylphenyl)-1,3,4-oxadiazole ...)
Affinity DataEC50: >5.00E+4nM. Assay description: Source (MLSCN Center Name): The Scripps Research Institute Molecular Screening Center Center Affiliation: The Scripps Research Institute, TSRI Assay ...
In DepthDetails PCBioAssay