BDBM424895 US10508120, Compound I-1399::US10577373, Compound I-1399::US11046698, Compound I-1399
SMILES CNc1cc(Nc2cccn([C@@H]3C[C@H]3F)c2=O)nc2c(cnn12)C(=O)NCC(C)(C)CO
InChI Key InChIKey=MPSKBHGTTIEAMV-UKRRQHHQSA-N
Data  3 Kd
  Tab Delimited (TSV)   2D SDfile   Computed 3D by Vconf -m prep SDfile
Find this compound or compounds like it in BindingDB:
Activity Spreadsheet -- Enzyme Inhibition Constant Data from BindingDB
Found 3 hits for monomerid = 424895
TargetNon-receptor tyrosine-protein kinase TYK2 [556-888](Homo sapiens (Human))
Nimbus Lakshimi
US Patent
LigandPNGBDBM424895(US10508120, Compound I-1399 | US10577373, Compound...)
Affinity DataKd:  5.5nM. Assay description: Binding constants for compounds of the present invention against the JH2 domain were determined by the following protocol for a KINOMEscan® assay (Di...
Ligand InfoPC cidPC sid
In DepthDetails US Patent
TargetNon-receptor tyrosine-protein kinase TYK2 [556-888](Homo sapiens (Human))
Nimbus Lakshimi
US Patent
LigandPNGBDBM424895(US10508120, Compound I-1399 | US10577373, Compound...)
Affinity DataKd:  5.5nM. Assay description: Binding constants for compounds of the present invention against the JH2 domain were determined by the following protocol for a KINOMEscan® assay (Di...
Ligand InfoPC cidPC sid
In DepthDetails US Patent
TargetNon-receptor tyrosine-protein kinase TYK2 [556-888](Homo sapiens (Human))
Nimbus Lakshimi
US Patent
LigandPNGBDBM424895(US10508120, Compound I-1399 | US10577373, Compound...)
Affinity DataKd:  5.5nM. Assay description: Binding constants for compounds of the present invention against the JH2 domain were determined by the following protocol for a KINOMEscan® assay (Di...
Ligand InfoPC cidPC sid
In DepthDetails US Patent