BDBM425070 5-(2-ethoxy-3-pyridyl)-1-isopropyl-3-methyl-N-[(2-methyl-1,2,4-triazol-3-yl)methyl]pyrazolo[4,3-b]pyridin-7-amine::US10512632, Example 161::US10618913, Example S161::US10766893, Example S161::US10806718, Example 161::US11026923, Example 161::US11491140, Example 162::US11634416, Example 161
SMILES CCOc1ncccc1-c1cc(NCc2ncnn2C)c2n(nc(C)c2n1)C(C)C
InChI Key InChIKey=DSJWNAKWTOCISO-UHFFFAOYSA-N
Data  24 IC50
  Tab Delimited (TSV)   2D SDfile   Computed 3D by Vconf -m prep SDfile
Find this compound or compounds like it in BindingDB:
Activity Spreadsheet -- Enzyme Inhibition Constant Data from BindingDB
Found 24 hits for monomerid = 425070
LigandPNGBDBM425070(5-(2-ethoxy-3-pyridyl)-1-isopropyl-3-methyl-N-[(2-...)
Affinity DataIC50:  60nM. Assay description: PDE1A, PDE1B and PDE1C assays were performed as follows: the assays was performed in 60 μL samples containing a fixed amount of the PDE1 enzyme ...
Ligand InfoPC cidPC sid
In DepthDetails US Patent
LigandPNGBDBM425070(5-(2-ethoxy-3-pyridyl)-1-isopropyl-3-methyl-N-[(2-...)
Affinity DataIC50:  120nM. Assay description: PDE1A, PDE1B and PDE1C assays were performed as follows: the assays was performed in 60 μL samples containing a fixed amount of the PDE1 enzyme ...
Ligand InfoPC cidPC sid
In DepthDetails US Patent
LigandPNGBDBM425070(5-(2-ethoxy-3-pyridyl)-1-isopropyl-3-methyl-N-[(2-...)
Affinity DataIC50:  120nM. Assay description: PDE1A, PDE1B and PDE1C assays were performed as follows: the assays was performed in 60 μL samples containing a fixed amount of the PDE1 enzyme ...
Ligand InfoPC cidPC sid
In DepthDetails US Patent
LigandPNGBDBM425070(5-(2-ethoxy-3-pyridyl)-1-isopropyl-3-methyl-N-[(2-...)
Affinity DataIC50:  60nM. Assay description: PDE1A, PDE1B and PDE1C assays were performed as follows: the assays were performed in 60 μL samples containing a fixed amount of the PDE1 enzyme...
Ligand InfoPC cidPC sid
In DepthDetails US Patent
LigandPNGBDBM425070(5-(2-ethoxy-3-pyridyl)-1-isopropyl-3-methyl-N-[(2-...)
Affinity DataIC50:  6.60nM. Assay description: PDE1A, PDE1B and PDE1C assays were performed as follows: the assays were performed in 60 μL samples containing a fixed amount of the PDE1 enzyme...
Ligand InfoPC cidPC sid
In DepthDetails US Patent
LigandPNGBDBM425070(5-(2-ethoxy-3-pyridyl)-1-isopropyl-3-methyl-N-[(2-...)
Affinity DataIC50:  120nM. Assay description: PDE1A, PDE1B and PDE1C assays were performed as follows: the assays were performed in 60 μL samples containing a fixed amount of the PDE1 enzyme...
Ligand InfoPC cidPC sid
In DepthDetails US Patent
LigandPNGBDBM425070(5-(2-ethoxy-3-pyridyl)-1-isopropyl-3-methyl-N-[(2-...)
Affinity DataIC50:  60nM. Assay description: PDE1A, PDE1B and PDE1C assays were performed as follows: the assays were performed in 60 μL samples containing a fixed amount of the PDE1 enzyme...
Ligand InfoPC cidPC sid
In DepthDetails US Patent
LigandPNGBDBM425070(5-(2-ethoxy-3-pyridyl)-1-isopropyl-3-methyl-N-[(2-...)
Affinity DataIC50:  6.60nM. Assay description: PDE1A, PDE1B and PDE1C assays were performed as follows: the assays were performed in 60 μL samples containing a fixed amount of the PDE1 enzyme...
Ligand InfoPC cidPC sid
In DepthDetails US Patent
LigandPNGBDBM425070(5-(2-ethoxy-3-pyridyl)-1-isopropyl-3-methyl-N-[(2-...)
Affinity DataIC50:  120nM. Assay description: PDE1A, PDE1B and PDE1C assays were performed as follows: the assays were performed in 60 μL samples containing a fixed amount of the PDE1 enzyme...
Ligand InfoPC cidPC sid
In DepthDetails US Patent
LigandPNGBDBM425070(5-(2-ethoxy-3-pyridyl)-1-isopropyl-3-methyl-N-[(2-...)
Affinity DataIC50:  60nM. Assay description: PDE1A, PDE1B and PDE1C assays were performed as follows: the assays was performed in 60 μL samples containing a fixed amount of the PDE1 enzyme ...
Ligand InfoPC cidPC sid
In DepthDetails US Patent
LigandPNGBDBM425070(5-(2-ethoxy-3-pyridyl)-1-isopropyl-3-methyl-N-[(2-...)
Affinity DataIC50:  6.60nM. Assay description: PDE1A, PDE1B and PDE1C assays were performed as follows: the assays was performed in 60 μL samples containing a fixed amount of the PDE1 enzyme ...
Ligand InfoPC cidPC sid
In DepthDetails US Patent
LigandPNGBDBM425070(5-(2-ethoxy-3-pyridyl)-1-isopropyl-3-methyl-N-[(2-...)
Affinity DataIC50:  120nM. Assay description: PDE1A, PDE1B and PDE1C assays were performed as follows: the assays was performed in 60 μL samples containing a fixed amount of the PDE1 enzyme ...
Ligand InfoPC cidPC sid
In DepthDetails US Patent
LigandPNGBDBM425070(5-(2-ethoxy-3-pyridyl)-1-isopropyl-3-methyl-N-[(2-...)
Affinity DataIC50:  60nM. Assay description: PDE1A, PDE1B and PDE1C assays were performed as follows: the assays was performed in 60 uL samples containing a fixed amount of the PDE1 enzyme (suff...
Ligand InfoPC cidPC sid
In DepthDetails US Patent
LigandPNGBDBM425070(5-(2-ethoxy-3-pyridyl)-1-isopropyl-3-methyl-N-[(2-...)
Affinity DataIC50:  6.60nM. Assay description: PDE1A, PDE1B and PDE1C assays were performed as follows: the assays was performed in 60 uL samples containing a fixed amount of the PDE1 enzyme (suff...
Ligand InfoPC cidPC sid
In DepthDetails US Patent
LigandPNGBDBM425070(5-(2-ethoxy-3-pyridyl)-1-isopropyl-3-methyl-N-[(2-...)
Affinity DataIC50:  120nM. Assay description: PDE1A, PDE1B and PDE1C assays were performed as follows: the assays was performed in 60 uL samples containing a fixed amount of the PDE1 enzyme (suff...
Ligand InfoPC cidPC sid
In DepthDetails US Patent
LigandPNGBDBM425070(5-(2-ethoxy-3-pyridyl)-1-isopropyl-3-methyl-N-[(2-...)
Affinity DataIC50:  60nM. Assay description: PDE1A, PDE1B and PDE1C assays were performed as follows: the assays was performed in 60 μL samples containing a fixed amount of the PDE1 enzyme ...
Ligand InfoPC cidPC sid
In DepthDetails US Patent
LigandPNGBDBM425070(5-(2-ethoxy-3-pyridyl)-1-isopropyl-3-methyl-N-[(2-...)
Affinity DataIC50:  6.60nM. Assay description: PDE1A, PDE1B and PDE1C assays were performed as follows: the assays was performed in 60 μL samples containing a fixed amount of the PDE1 enzyme ...
Ligand InfoPC cidPC sid
In DepthDetails US Patent
LigandPNGBDBM425070(5-(2-ethoxy-3-pyridyl)-1-isopropyl-3-methyl-N-[(2-...)
Affinity DataIC50:  120nM. Assay description: PDE1A, PDE1B and PDE1C assays were performed as follows: the assays was performed in 60 μL samples containing a fixed amount of the PDE1 enzyme ...
Ligand InfoPC cidPC sid
In DepthDetails US Patent
LigandPNGBDBM425070(5-(2-ethoxy-3-pyridyl)-1-isopropyl-3-methyl-N-[(2-...)
Affinity DataIC50:  100nM. Assay description: PDE1A, PDE1B and PDE1C assays were performed as follows: the assays was performed in 60 μL samples containing a fixed amount of the PDE1 enzyme ...
Ligand InfoPC cidPC sid
In DepthDetails US Patent
LigandPNGBDBM425070(5-(2-ethoxy-3-pyridyl)-1-isopropyl-3-methyl-N-[(2-...)
Affinity DataIC50:  13nM. Assay description: PDE1A, PDE1B and PDE1C assays were performed as follows: the assays was performed in 60 μL samples containing a fixed amount of the PDE1 enzyme ...
Ligand InfoPC cidPC sid
In DepthDetails US Patent
LigandPNGBDBM425070(5-(2-ethoxy-3-pyridyl)-1-isopropyl-3-methyl-N-[(2-...)
Affinity DataIC50:  180nM. Assay description: PDE1A, PDE1B and PDE1C assays were performed as follows: the assays was performed in 60 μL samples containing a fixed amount of the PDE1 enzyme ...
Ligand InfoPC cidPC sid
In DepthDetails US Patent
LigandPNGBDBM425070(5-(2-ethoxy-3-pyridyl)-1-isopropyl-3-methyl-N-[(2-...)
Affinity DataIC50:  60nM. Assay description: PDE1A, PDE1B and PDE1C assays were performed as follows: the assays was performed in 60 μL samples containing a fixed amount of the PDE1 enzyme ...
Ligand InfoPC cidPC sid
In DepthDetails US Patent
LigandPNGBDBM425070(5-(2-ethoxy-3-pyridyl)-1-isopropyl-3-methyl-N-[(2-...)
Affinity DataIC50:  6.60nM. Assay description: PDE1A, PDE1B and PDE1C assays were performed as follows: the assays was performed in 60 μL samples containing a fixed amount of the PDE1 enzyme ...
Ligand InfoPC cidPC sid
In DepthDetails US Patent
LigandPNGBDBM425070(5-(2-ethoxy-3-pyridyl)-1-isopropyl-3-methyl-N-[(2-...)
Affinity DataIC50:  6.60nM. Assay description: PDE1A, PDE1B and PDE1C assays were performed as follows: the assays was performed in 60 μL samples containing a fixed amount of the PDE1 enzyme ...
Ligand InfoPC cidPC sid
In DepthDetails US Patent