BDBM42593 2-[1-(2-furanylmethylamino)ethylidene]indene-1,3-dione::2-[1-(2-furfurylamino)ethylidene]indane-1,3-quinone::2-[1-(furan-2-ylmethylamino)ethylidene]indene-1,3-dione::2-{1-[(Furan-2-ylmethyl)-amino]-ethylidene}-indan-1,3-dione::MLS000029770::SMR000011625::cid_649653
SMILES [#6]\[#6](-[#7]-[#6]-c1ccco1)=[#6]-1\[#6](=O)-c2ccccc2-[#6]-1=O
InChI Key InChIKey=HFXXPLUGEMBMFQ-UHFFFAOYSA-N
Data  1 IC50  1 EC50
  Tab Delimited (TSV)   2D SDfile   Computed 3D by Vconf -m prep SDfile
Find this compound or compounds like it in BindingDB:
Activity Spreadsheet -- Enzyme Inhibition Constant Data from BindingDB
Found 2 hits for monomerid = 42593
TargetHeat shock factor protein 1(Mus musculus)
Broad Institute
Curated by PubChem BioAssay
LigandPNGBDBM42593(2-[1-(2-furanylmethylamino)ethylidene]indene-1,3-d...)
Affinity DataEC50: >2.60E+5nM. Assay description: Keywords: Heat Shock Factor-1 (HSF-1), Stress Response, MG132, NIH3T3, Luminescence Assay Overview: Confirmation testing of small molecules identifie...
In DepthDetails PCBioAssay
TargetMitogen-activated protein kinase 10(Homo sapiens (Human))
The Scripps Research Institute Molecular Screening Center
Curated by PubChem BioAssay
LigandPNGBDBM42593(2-[1-(2-furanylmethylamino)ethylidene]indene-1,3-d...)
Affinity DataIC50:  3.09E+4nM. Assay description: Source (MLSCN Center Name): The Scripps Research Institute Molecular Screening Center Affiliation: The Scripps Research Institute, TSRI Assay Provide...
In DepthDetails PCBioAssay