BDBM42636 3-(2-quinolinylthio)propanoic acid::3-(2-quinolylthio)propionic acid::3-quinolin-2-ylsulfanylpropanoic acid::MLS000077859::SMR000042255::cid_661670
SMILES OC(=O)CCSc1ccc2ccccc2n1
InChI Key InChIKey=QKYKAHGSVSTGFP-UHFFFAOYSA-N
Data  2 IC50
  Tab Delimited (TSV)   2D SDfile   Computed 3D by Vconf -m prep SDfile
Find this compound or compounds like it in BindingDB:
Activity Spreadsheet -- Enzyme Inhibition Constant Data from BindingDB
Found 2 hits for monomerid = 42636
TargetMajor prion protein(Homo sapiens (Human))
The Scripps Research Institute Molecular Screening Center
Curated by PubChem BioAssay
LigandPNGBDBM42636(3-(2-quinolinylthio)propanoic acid | 3-(2-quinolyl...)
Affinity DataIC50:  3.19E+3nM. Assay description: Source (MLPCN Center Name): The Scripps Research Institute Molecular Screening Center (SRIMSC) Affiliation: The Scripps Research Institute, TSRI Assa...
In DepthDetails PCBioAssay
TargetMitogen-activated protein kinase 10(Homo sapiens (Human))
The Scripps Research Institute Molecular Screening Center
Curated by PubChem BioAssay
LigandPNGBDBM42636(3-(2-quinolinylthio)propanoic acid | 3-(2-quinolyl...)
Affinity DataIC50:  3.48E+4nM. Assay description: Source (MLSCN Center Name): The Scripps Research Institute Molecular Screening Center Affiliation: The Scripps Research Institute, TSRI Assay Provide...
In DepthDetails PCBioAssay