BDBM4265 (2-Ethyl-3-hydroxy)benzoyl-(2S,3S)-AHPBA-4(S)-Cl-Pro-NH-t-Bu::(2S,4S)-N-tert-butyl-4-chloro-1-[(2S,3S)-3-[(2-ethyl-3-hydroxyphenyl)formamido]-2-hydroxy-4-phenylbutanoyl]pyrrolidine-2-carboxamide::AHPBA 34
SMILES CCc1c(O)cccc1C(=O)N[C@@H](Cc1ccccc1)[C@H](O)C(=O)N1C[C@@H](Cl)C[C@H]1C(=O)NC(C)(C)C
InChI Key InChIKey=CXFJYDPGWULAOP-CKLTXHEASA-N
Data  1 IC50
  Tab Delimited (TSV)   2D SDfile   Computed 3D by Vconf -m prep SDfile
Find this compound or compounds like it in BindingDB:
Activity Spreadsheet -- Enzyme Inhibition Constant Data from BindingDB
Found 1 hit for monomerid = 4265
TargetDimer of Gag-Pol polyprotein [489-587](Human immunodeficiency virus type 1)
Sankyo
LigandPNGBDBM4265((2-Ethyl-3-hydroxy)benzoyl-(2S,3S)-AHPBA-4(S)-Cl-P...)
Affinity DataIC50:  0.900nM. Assay description: The inhibitory activities of the compounds toward HIV-1 PR were determined by sodium dodecyl sulfate-polyacrylamide gel electrophoresis (SDS-PAGE) as...
In DepthDetails ArticlePubMed