BDBM42746 5H-pyrido[2,3-b][1,4]benzothiazepin-6-one::MLS000093580::SMR000029198::cid_3243778::pyrido[2,3-b][1,4]benzothiazepin-6(5H)-one
SMILES O=C1Nc2cccnc2Sc2ccccc12
InChI Key InChIKey=FTMBGAIUQQPJDQ-UHFFFAOYSA-N
Data  1 IC50
  Tab Delimited (TSV)   2D SDfile   Computed 3D by Vconf -m prep SDfile
Find this compound or compounds like it in BindingDB:
Activity Spreadsheet -- Enzyme Inhibition Constant Data from BindingDB
Found 1 hit for monomerid = 42746
TargetMitogen-activated protein kinase 10(Homo sapiens (Human))
The Scripps Research Institute Molecular Screening Center
Curated by PubChem BioAssay
LigandPNGBDBM42746(5H-pyrido[2,3-b][1,4]benzothiazepin-6-one | MLS000...)
Affinity DataIC50:  5.00E+3nM. Assay description: Source (MLSCN Center Name): The Scripps Research Institute Molecular Screening Center Affiliation: The Scripps Research Institute, TSRI Assay Provide...
In DepthDetails PCBioAssay