BDBM42770 3-[(5-methylthiophene-3-carbonyl)amino]thiophene-2-carboxylic acid methyl ester::3-[[(5-methyl-3-thiophenyl)-oxomethyl]amino]-2-thiophenecarboxylic acid methyl ester::MLS000065788::SMR000080473::cid_1245967::methyl 3-[(5-methylthiophen-3-yl)carbonylamino]thiophene-2-carboxylate::methyl 3-[(5-methylthiophene-3-carbonyl)amino]thiophene-2-carboxylate::methyl 3-{[(5-methyl-3-thienyl)carbonyl]amino}-2-thiophenecarboxylate
SMILES COC(=O)c1sccc1NC(=O)c1csc(C)c1
InChI Key InChIKey=BUIZWUHTUPUZCX-UHFFFAOYSA-N
Data  3 IC50  1 EC50
  Tab Delimited (TSV)   2D SDfile   Computed 3D by Vconf -m prep SDfile
Find this compound or compounds like it in BindingDB:
Activity Spreadsheet -- Enzyme Inhibition Constant Data from BindingDB
Found 4 hits for monomerid = 42770
TargetMitogen-activated protein kinase 10(Homo sapiens (Human))
The Scripps Research Institute Molecular Screening Center
Curated by PubChem BioAssay
LigandPNGBDBM42770(3-[(5-methylthiophene-3-carbonyl)amino]thiophene-2...)
Affinity DataIC50:  3.85E+4nM. Assay description: Source (MLSCN Center Name): The Scripps Research Institute Molecular Screening Center Affiliation: The Scripps Research Institute, TSRI Assay Provide...
In DepthDetails PCBioAssay
TargetCaspase-1(Homo sapiens (Human))
Burnham Center For Chemical Genomics
Curated by PubChem BioAssay
LigandPNGBDBM42770(3-[(5-methylthiophene-3-carbonyl)amino]thiophene-2...)
Affinity DataIC50:  6.04E+4nM. Assay description: Data Source: Sanford-Burnham Center for Chemical Genomics (SBCCG) Source Affiliation: Sanford-Burnham Medical Research Institute (SBMRI, San Diego, C...
In DepthDetails PCBioAssay
TargetNACHT, LRR and PYD domains-containing protein 1(Homo sapiens (Human))
Burnham Center For Chemical Genomics
Curated by PubChem BioAssay
LigandPNGBDBM42770(3-[(5-methylthiophene-3-carbonyl)amino]thiophene-2...)
Affinity DataIC50:  1.59E+4nM. Assay description: Data Source: Sanford-Burnham Center for Chemical Genomics (SBCCG) Source Affiliation: Sanford-Burnham Medical Research Institute (SBMRI, San Diego, C...
In DepthDetails PCBioAssay
TargetImportin subunit alpha-1(Homo sapiens (Human))
Broad Institute
Curated by PubChem BioAssay
LigandPNGBDBM42770(3-[(5-methylthiophene-3-carbonyl)amino]thiophene-2...)
Affinity DataEC50: >5.00E+5nM. Assay description: Keywords: Counterscreen, FRET assay, HTS, YIC probe, Dose response, Assay Overview: This is a fluorescence resonance energy transfer (FRET)-based b...
In DepthDetails PCBioAssay