BDBM429083 jm5b01461, Compound 33
SMILES CN(C)c1ccc(cc1)C(=O)N[C@@H](Cc1ccccc1)C(=O)Nc1ccc(cc1)[N+]([O-])=O
InChI Key InChIKey=IWQFYHUNPNJZET-QFIPXVFZSA-N
Data  2 IC50
  Tab Delimited (TSV)   2D SDfile   Computed 3D by Vconf -m prep SDfile
Find this compound or compounds like it in BindingDB:
Activity Spreadsheet -- Enzyme Inhibition Constant Data from BindingDB
Found 2 hits for monomerid = 429083
TargetReplicase polyprotein 1ab(Human SARS coronavirus (SARS-CoV) (Severe acute re...)
University Of Bonn
LigandPNGBDBM429083(jm5b01461, Compound 33)
Affinity DataIC50: >1.00E+4nM. Assay description: This is a review article.
Ligand InfoKEGGPC cidPC sid
In DepthDetails ArticlePubMed
TargetReplicase polyprotein 1ab(Human SARS coronavirus (SARS-CoV) (Severe acute re...)
University Of Bonn
LigandPNGBDBM429083(jm5b01461, Compound 33)
Affinity DataIC50: >1.00E+4nM. Assay description: This is a review article.
Ligand InfoKEGGPC cidPC sid
In DepthDetails ArticlePubMed