BDBM42921 1-[[4-amino-6-(2-methylanilino)-1,3,5-triazin-2-yl]methylsulfanyl]-4-prop-2-enyl-[1,2,4]triazolo[4,3-a]quinazolin-5-one::1-[[4-amino-6-(2-methylanilino)-1,3,5-triazin-2-yl]methylthio]-4-prop-2-enyl-[1,2,4]triazolo[4,3-a]quinazolin-5-one::1-[[4-azanyl-6-[(2-methylphenyl)amino]-1,3,5-triazin-2-yl]methylsulfanyl]-4-prop-2-enyl-[1,2,4]triazolo[4,3-a]quinazolin-5-one::4-allyl-1-[[4-amino-6-(o-toluidino)-s-triazin-2-yl]methylthio]-[1,2,4]triazolo[4,3-a]quinazolin-5-one::MLS000054710::SMR000065306::cid_2482938
SMILES Cc1ccccc1Nc1nc(N)nc(CSc2nnc3n(CC=C)c(=O)c4ccccc4n23)n1
InChI Key InChIKey=PCVKZGCXKPOIJV-UHFFFAOYSA-N
Data  3 EC50
  Tab Delimited (TSV)   2D SDfile   Computed 3D by Vconf -m prep SDfile
Find this compound or compounds like it in BindingDB:
Activity Spreadsheet -- Enzyme Inhibition Constant Data from BindingDB
Found 3 hits for monomerid = 42921
TargetNuclear receptor coactivator 3(Homo sapiens (Human))
The Scripps Research Institute Molecular Screening Center
Curated by PubChem BioAssay
LigandPNGBDBM42921(1-[[4-amino-6-(2-methylanilino)-1,3,5-triazin-2-yl...)
Affinity DataEC50: >7.94E+4nM. Assay description: Source (MLSCN Center Name): The Scripps Research Institute Molecular Screening Center http://molscreen.florida.scripps.edu/ Center Affiliation: The ...
In DepthDetails PCBioAssay
TargetNuclear receptor coactivator 1(Homo sapiens (Human))
The Scripps Research Institute Molecular Screening Center
Curated by PubChem BioAssay
LigandPNGBDBM42921(1-[[4-amino-6-(2-methylanilino)-1,3,5-triazin-2-yl...)
Affinity DataEC50: >7.94E+4nM. Assay description: Source (MLSCN Center Name): The Scripps Research Institute Molecular Screening Center Center Affiliation: The Scripps Research Institute (TSRI) Assay...
In DepthDetails PCBioAssay
TargetNuclear receptor coactivator 2(Homo sapiens (Human))
The Scripps Research Institute Molecular Screening Center
Curated by PubChem BioAssay
LigandPNGBDBM42921(1-[[4-amino-6-(2-methylanilino)-1,3,5-triazin-2-yl...)
Affinity DataEC50: >7.94E+4nM. Assay description: Source (MLSCN Center Name): The Scripps Research Institute Molecular Screening Center Center Affiliation: The Scripps Research Institute (TSRI) Assay...
In DepthDetails PCBioAssay