BDBM429263 jm5b01461, Compound 81
SMILES CC1CCN(CC1)S(=O)(=O)c1ccc2C(Cc3ccccc3)C(=O)C(=O)c2c1
InChI Key InChIKey=XMQJYRFXKWGGMV-UHFFFAOYSA-N
Data  1 IC50
  Tab Delimited (TSV)   2D SDfile   Computed 3D by Vconf -m prep SDfile
Find this compound or compounds like it in BindingDB:
Activity Spreadsheet -- Enzyme Inhibition Constant Data from BindingDB
Found 1 hit for monomerid = 429263
TargetReplicase polyprotein 1ab(Human SARS coronavirus (SARS-CoV) (Severe acute re...)
University Of Bonn
LigandPNGBDBM429263(jm5b01461, Compound 81)
Affinity DataIC50:  1.04E+3nM. Assay description: This is a review article.
Ligand InfoPC cidPC sid
In DepthDetails ArticlePubMed