BDBM429324 jm5b01461, Compound 143.1
SMILES Brc1ccc(cc1)C(=O)N1C[C@@H]2CCCC[C@@H]2C[C@H]1CNC(Cc1c[nH]cn1)C=O
InChI Key InChIKey=SKLHMRHVVDDIOX-UTHQURFGSA-N
Data  1 IC50
  Tab Delimited (TSV)   2D SDfile   Computed 3D by Vconf -m prep SDfile
Find this compound or compounds like it in BindingDB:
Activity Spreadsheet -- Enzyme Inhibition Constant Data from BindingDB
Found 1 hit for monomerid = 429324
TargetReplicase polyprotein 1ab(Human SARS coronavirus (SARS-CoV) (Severe acute re...)
University Of Bonn
LigandPNGBDBM429324(jm5b01461, Compound 143.1)
Affinity DataIC50:  6.30E+3nM. Assay description: This is a review article.
Ligand InfoPC cidPC sid
In DepthDetails ArticlePubMed