BDBM429340 jm5b01461, Compound 157
SMILES CCC(C)(C)NC(=O)C(N(C(=O)Cn1nnc2ccccc12)c1ccc(NC(C)=O)cc1)c1ccn(C)c1
InChI Key InChIKey=DSWIUPQAVIEPFY-UHFFFAOYSA-N
Data  3 IC50
  Tab Delimited (TSV)   2D SDfile   Computed 3D by Vconf -m prep SDfile
Find this compound or compounds like it in BindingDB:
Activity Spreadsheet -- Enzyme Inhibition Constant Data from BindingDB
Found 3 hits for monomerid = 429340
TargetReplicase polyprotein 1ab(Human SARS coronavirus (SARS-CoV) (Severe acute re...)
University Of Bonn
LigandPNGBDBM429340(jm5b01461, Compound 157)
Affinity DataIC50:  6.20E+3nM. Assay description: This is a review article.
Ligand InfoPC cidPC sid
In DepthDetails ArticlePubMed
TargetReplicase polyprotein 1ab(Human SARS coronavirus (SARS-CoV) (Severe acute re...)
University Of Bonn
LigandPNGBDBM429340(jm5b01461, Compound 157)
Affinity DataIC50:  6.20E+3nM. Assay description: This is a review article.
Ligand InfoPC cidPC sid
In DepthDetails ArticlePubMed
TargetReplicase polyprotein 1a(Human SARS coronavirus (SARS-CoV))
University Of Bonn
LigandPNGBDBM429340(jm5b01461, Compound 157)
Affinity DataIC50: >6.00E+4nM. Assay description: This is a review article.
Ligand InfoPC cidPC sid
In DepthDetails ArticlePubMed