BDBM430640 Clomiphene
SMILES CCN(CC)CCOc1ccc(cc1)C(=C(Cl)c1ccccc1)c1ccccc1
InChI Key InChIKey=GKIRPKYJQBWNGO-QPLCGJKRSA-N
Data  1 IC50
  Tab Delimited (TSV)   2D SDfile   Computed 3D by Vconf -m prep SDfile
Find this compound or compounds like it in BindingDB:
Activity Spreadsheet -- Enzyme Inhibition Constant Data from BindingDB
Found 1 hit for monomerid = 430640
TargetReplicase polyprotein 1ab(2019-nCoV)
Institut Pasteur Korea
LigandPNGBDBM430640(Clomiphene)
Affinity DataIC50:  5.36E+3nM. Assay description: Ten-point DRCs were generated for each drug. Vero cells were seeded at 1.2 × 104 cells per well in DMEM, supplemented with 2% FBS and 1× ...
In DepthDetails ArticlePubMed