BDBM430773 (4-(thiophen-2-yl)phenyl)(3-(2-(thiophen-2-yl)thiazol-4-yl)-5,6-dihydro-[1,2,4]triazolo[4,3-a]pyrazin-7(8H)-yl)methanone::US10544150, Compound 194
SMILES O=C(N1CCn2c(C1)nnc2-c1csc(n1)-c1cccs1)c1ccc(cc1)-c1cccs1
InChI Key InChIKey=JIAHPKUVJGANOT-UHFFFAOYSA-N
Data  1 KI
  Tab Delimited (TSV)   2D SDfile   Computed 3D by Vconf -m prep SDfile
Find this compound or compounds like it in BindingDB:
Activity Spreadsheet -- Enzyme Inhibition Constant Data from BindingDB
Found 1 hit for monomerid = 430773
TargetNeuromedin-K receptor(Homo sapiens (Human))
Ogeda
US Patent
LigandPNGBDBM430773((4-(thiophen-2-yl)phenyl)(3-(2-(thiophen-2-yl)thia...)
Affinity DataKi: <500nM. Assay description: The ability of the compounds of the invention to inhibit the binding of the NK-3 receptor selective antagonist SB222200 was assessed by an in vitro r...
Ligand InfoPC cidPC sid
In DepthDetails US Patent