BDBM430889 US10550102, Example 17a
SMILES CCc1c(cnn1-c1cccc(n1)-c1cccc2C(C)CN(Cc3ccc(C4CCN(CC4)C(=O)[C@H](C)O)c(CC)c3)c12)C(O)=O
InChI Key InChIKey=YUGYFCOSKDDEIM-CGAIIQECSA-N
Data  1 EC50
  Tab Delimited (TSV)   2D SDfile   Computed 3D by Vconf -m prep SDfile
Find this compound or compounds like it in BindingDB:
Activity Spreadsheet -- Enzyme Inhibition Constant Data from BindingDB
Found 1 hit for monomerid = 430889
TargetGuanylate cyclase soluble subunit alpha-1/beta-1(Homo sapiens (Human))
Novartis
US Patent
LigandPNGBDBM430889(US10550102, Example 17a)
Affinity DataEC50:  0.5nM. Assay description: Chinese hamster ovary (CHO) cells overexpressing soluble guanylate cyclase were generated to test the effect of sGC activators in a cellular context....
Ligand InfoPC cidPC sid
In DepthDetails US Patent