BDBM430921 Example 24-A. Ethyl 5-methyl-1-(6-(1-(2-methyl-4-(piperidin-4-yl)benzyl)indolin-7-yl)pyridin-2-yl)-1H-pyrazole-4-carboxylate::US10550102, Example 24
SMILES CCOC(=O)c1cnn(c1C)-c1cccc(n1)-c1cccc2CCN(Cc3ccc(cc3C)C3CCNCC3)c12
InChI Key InChIKey=RRFOAFYWIBQTMM-UHFFFAOYSA-N
Data  1 EC50
  Tab Delimited (TSV)   2D SDfile   Computed 3D by Vconf -m prep SDfile
Find this compound or compounds like it in BindingDB:
Activity Spreadsheet -- Enzyme Inhibition Constant Data from BindingDB
Found 1 hit for monomerid = 430921
TargetGuanylate cyclase soluble subunit alpha-1/beta-1(Homo sapiens (Human))
Novartis
US Patent
LigandPNGBDBM430921(Example 24-A. Ethyl 5-methyl-1-(6-(1-(2-methyl-4-(...)
Affinity DataEC50:  7.90nM. Assay description: Chinese hamster ovary (CHO) cells overexpressing soluble guanylate cyclase were generated to test the effect of sGC activators in a cellular context....
Ligand InfoPC cidPC sid
In DepthDetails US Patent