BDBM430981 US10550102, Example 58. b). (+)
SMILES CCOC(=O)c1cnn(c1C)-c1cccc(n1)-c1cccc2CCC(Nc3ccc(cc3C)C3CCN(CC3)c3nnc(C)o3)c12
InChI Key InChIKey=XDEAUSRHVZGLDC-UHFFFAOYSA-N
Data  1 EC50
  Tab Delimited (TSV)   2D SDfile   Computed 3D by Vconf -m prep SDfile
Find this compound or compounds like it in BindingDB:
Activity Spreadsheet -- Enzyme Inhibition Constant Data from BindingDB
Found 1 hit for monomerid = 430981
TargetGuanylate cyclase soluble subunit alpha-1/beta-1(Homo sapiens (Human))
Novartis
US Patent
LigandPNGBDBM430981(US10550102, Example 58. b). (+))
Affinity DataEC50:  0.5nM. Assay description: Chinese hamster ovary (CHO) cells overexpressing soluble guanylate cyclase were generated to test the effect of sGC activators in a cellular context....
Ligand InfoPC cidPC sid
In DepthDetails US Patent