BDBM43132 2-morpholino-5-nitro-N-[4-(p-tolyl)thiazol-2-yl]benzamide::MLS000388869::N-[4-(4-methylphenyl)-1,3-thiazol-2-yl]-2-morpholin-4-yl-5-nitro-benzamide::N-[4-(4-methylphenyl)-1,3-thiazol-2-yl]-2-morpholin-4-yl-5-nitrobenzamide::N-[4-(4-methylphenyl)-2-thiazolyl]-2-(4-morpholinyl)-5-nitrobenzamide::SMR000255042::cid_4367431
SMILES Cc1ccc(cc1)-c1csc(NC(=O)c2cc(ccc2N2CCOCC2)[N+]([O-])=O)n1
InChI Key InChIKey=TVLDNHKEZXPYHY-UHFFFAOYSA-N
Data  3 EC50
  Tab Delimited (TSV)   2D SDfile   Computed 3D by Vconf -m prep SDfile
Find this compound or compounds like it in BindingDB:
Activity Spreadsheet -- Enzyme Inhibition Constant Data from BindingDB
Found 3 hits for monomerid = 43132
TargetNuclear receptor coactivator 2(Homo sapiens (Human))
The Scripps Research Institute Molecular Screening Center
Curated by PubChem BioAssay
LigandPNGBDBM43132(2-morpholino-5-nitro-N-[4-(p-tolyl)thiazol-2-yl]be...)
Affinity DataEC50: >7.94E+4nM. Assay description: Source (MLSCN Center Name): The Scripps Research Institute Molecular Screening Center Center Affiliation: The Scripps Research Institute (TSRI) Assay...
In DepthDetails PCBioAssay
TargetNuclear receptor coactivator 3(Homo sapiens (Human))
The Scripps Research Institute Molecular Screening Center
Curated by PubChem BioAssay
LigandPNGBDBM43132(2-morpholino-5-nitro-N-[4-(p-tolyl)thiazol-2-yl]be...)
Affinity DataEC50: >7.94E+4nM. Assay description: Source (MLSCN Center Name): The Scripps Research Institute Molecular Screening Center http://molscreen.florida.scripps.edu/ Center Affiliation: The ...
In DepthDetails PCBioAssay
TargetNuclear receptor coactivator 1(Homo sapiens (Human))
The Scripps Research Institute Molecular Screening Center
Curated by PubChem BioAssay
LigandPNGBDBM43132(2-morpholino-5-nitro-N-[4-(p-tolyl)thiazol-2-yl]be...)
Affinity DataEC50: >7.94E+4nM. Assay description: Source (MLSCN Center Name): The Scripps Research Institute Molecular Screening Center Center Affiliation: The Scripps Research Institute (TSRI) Assay...
In DepthDetails PCBioAssay