BDBM431874 US10550114, Compound 29
SMILES CN(CCc1ccc(cc1)N(C)C(=O)C=C)Cc1ccc(cc1)-c1nc2ccn(C)c(=O)c2cc1-c1ccccc1
InChI Key InChIKey=GXEALJGVCINJSV-UHFFFAOYSA-N
Data  3 IC50  1 Kd
  Tab Delimited (TSV)   2D SDfile   Computed 3D by Vconf -m prep SDfile
Find this compound or compounds like it in BindingDB:
Activity Spreadsheet -- Enzyme Inhibition Constant Data from BindingDB
Found 4 hits for monomerid = 431874
TargetRAC-alpha serine/threonine-protein kinase(Homo sapiens (Human))
Technische UniversitÄT Dortmund
US Patent
LigandPNGBDBM431874(US10550114, Compound 29)
Affinity DataKd:  498nM. Assay description: iFLiK and HTRF studies were carried out as described in Z. Fang, J. R. Simard, D. Plenker, H. D. Nguyen, T. Phan, P. Wolle, S. Baumeister, D. Rauh, A...
Ligand InfoPC cidPC sid
In DepthDetails US Patent
TargetRAC-alpha serine/threonine-protein kinase [E17K](Homo sapiens (Human))
Technische UniversitÄT Dortmund
US Patent
LigandPNGBDBM431874(US10550114, Compound 29)
Affinity DataIC50:  2.81E+4nM. Assay description: iFLiK and HTRF studies were carried out as described in Z. Fang, J. R. Simard, D. Plenker, H. D. Nguyen, T. Phan, P. Wolle, S. Baumeister, D. Rauh, A...
Ligand InfoPC cidPC sid
In DepthDetails US Patent
TargetRAC-alpha serine/threonine-protein kinase(Homo sapiens (Human))
Technische UniversitÄT Dortmund
US Patent
LigandPNGBDBM431874(US10550114, Compound 29)
Affinity DataIC50:  387nM. Assay description: iFLiK and HTRF studies were carried out as described in Z. Fang, J. R. Simard, D. Plenker, H. D. Nguyen, T. Phan, P. Wolle, S. Baumeister, D. Rauh, A...
Ligand InfoPC cidPC sid
In DepthDetails US Patent
TargetRAC-alpha serine/threonine-protein kinase(Homo sapiens (Human))
Technische UniversitÄT Dortmund
US Patent
LigandPNGBDBM431874(US10550114, Compound 29)
Affinity DataIC50:  249nM. Assay description: iFLiK and HTRF studies were carried out as described in Z. Fang, J. R. Simard, D. Plenker, H. D. Nguyen, T. Phan, P. Wolle, S. Baumeister, D. Rauh, A...
Ligand InfoPC cidPC sid
In DepthDetails US Patent