BDBM431929 US10550127, Example 15::[(S)-6-((R)-7-Fluoro-4-{4-[2-(2-hydroxo-2-methyl-propyl)-2H-tetrazol-5-yl]-2,6-dimethyl-phenyl}-indan-1-ylamino)-2,3-dihydro-furo[3,2-c]pyridin-3-yl]-acetic acid
SMILES Cc1cc(cc(C)c1-c1ccc(F)c2[C@@H](CCc12)Nc1cc2OC[C@@H](CC(O)=O)c2cn1)-c1nnn(CC(C)(C)O)n1
InChI Key InChIKey=ZMXOXGCAQWUDET-NTKDMRAZSA-N
Data  1 EC50
  Tab Delimited (TSV)   2D SDfile   Computed 3D by Vconf -m prep SDfile
Find this compound or compounds like it in BindingDB:
Activity Spreadsheet -- Enzyme Inhibition Constant Data from BindingDB
Found 1 hit for monomerid = 431929
TargetFree fatty acid receptor 1(Homo sapiens (Human))
Boehringer Ingelheim International
US Patent
LigandPNGBDBM431929(US10550127, Example 15 | [(S)-6-((R)-7-Fluoro-4-{4...)
Affinity DataEC50:  9nM. Assay description: IP1 accumulation measurements using the IPOne assay system—1321N1 cells stably expressing human GPR40 receptor (Euroscreen, Belgium) are seeded 24 h ...
Ligand InfoPC cidPC sid
In DepthDetails US Patent