BDBM431996 US10576064, Example I-206
SMILES Cc1cc(cc(C)c1C(O)=O)N1CC[C@H]2[C@H]([C@H](c3cccc(Cl)c3F)[C@@]3(N2CC2CC2)C(=O)Nc2cc(Cl)ccc32)C1=O
InChI Key InChIKey=OSYXIHMFGARYQG-JLLCTVPFSA-N
Data  1 IC50
  Tab Delimited (TSV)   2D SDfile   Computed 3D by Vconf -m prep SDfile
Find this compound or compounds like it in BindingDB:
Activity Spreadsheet -- Enzyme Inhibition Constant Data from BindingDB
Found 1 hit for monomerid = 431996
TargetE3 ubiquitin-protein ligase Mdm2 [23-127](Homo sapiens (Human))
Boehringer Ingelheim International
US Patent
LigandPNGBDBM431996(US10576064, Example I-206)
Affinity DataIC50:  46nM. Assay description: This assay is used to determine whether the compounds inhibit the p53-MDM2 interaction and thus restore p53 function.15 μL of compound in 20% DM...
Ligand InfoPC cidPC sid
In DepthDetails US Patent