BDBM432092 US10577330, Comparison Compound C1
SMILES OC1CNC(Nc2cc(O)cc(c2)C(=O)NCC(=O)N[C@@H](CC(O)=O)c2cc(Cl)cc(Br)c2O)=NC1
InChI Key InChIKey=XROUNTCRSNMMAO-KRWDZBQOSA-N
Data  7 IC50
  Tab Delimited (TSV)   2D SDfile   Computed 3D by Vconf -m prep SDfile
Find this compound or compounds like it in BindingDB:
Activity Spreadsheet -- Enzyme Inhibition Constant Data from BindingDB
Found 7 hits for monomerid = 432092
TargetIntegrin alpha-5/beta-1 [T112H](Homo sapiens (Human))
Saint Louis University
US Patent
LigandPNGBDBM432092(US10577330, Comparison Compound C1)
Affinity DataIC50:  16nM. Assay description: Purified human fibronectin (R&D Systems, 1918-FN) diluted to 2 μg/mL in TBS+ buffer (25 mM Tris pH 7.4, 137 mM NaCl, 2.7 mM KCl, 1 mM CaCl2, 1 m...
Ligand InfoPC cidPC sid
In DepthDetails US Patent
TargetIntegrin alpha-5/alpha-8(Homo sapiens (Human))
Saint Louis University
US Patent
LigandPNGBDBM432092(US10577330, Comparison Compound C1)
Affinity DataIC50:  8nM. Assay description: Recombinant mouse nephronectin protein (R&D Systems, Inc, 4298-NP) diluted to 1 μg/mL in TBS+ buffer (25 mM Tris pH 7.4, 137 mM NaCl, 2.7 mM KCl...
Ligand InfoPC cidPC sid
In DepthDetails US Patent
TargetIntegrin alpha-5/alpha-V(Homo sapiens (Human))
Saint Louis University
US Patent
LigandPNGBDBM432092(US10577330, Comparison Compound C1)
Affinity DataIC50:  17nM. Assay description: Purified human fibronectin (R&D Systems, 1918-FN) diluted to 5 μg/mL in TBS+ buffer (25 mM Tris pH 7.4, 137 mM NaCl, 2.7 mM KCl, 1 mM CaCl2, 1 m...
Ligand InfoPC cidPC sid
In DepthDetails US Patent
TargetIntegrin alpha-V/beta-8(Homo sapiens (Human))
Saint Louis University
US Patent
LigandPNGBDBM432092(US10577330, Comparison Compound C1)
Affinity DataIC50:  3nM. Assay description: Recombinant human LAP protein (R&D Systems, Inc, 246-LP) diluted to 0.5 g/mL in TBS+ buffer (25 mM Tris pH 7.4, 137 mM NaCl, 2.7 mM KCl, 1 mM CaCl2, ...
Ligand InfoPC cidPC sid
In DepthDetails US Patent
TargetIntegrin alpha-V/beta-5(Homo sapiens (Human))
Saint Louis University
US Patent
LigandPNGBDBM432092(US10577330, Comparison Compound C1)
Affinity DataIC50:  3nM. Assay description: Recombinant human vitronectin (R& D Systems, 2308-VN) at 0.25 μg/mL in TBS+ buffer (25 mM Tris pH 7.4, 137 mM NaCl, 2.7 mM KCl, 1 mM CaCl2, 1 mM...
Ligand InfoPC cidPC sid
In DepthDetails US Patent
TargetIntegrin alpha-5/beta-6(Homo sapiens (Human))
Saint Louis University
US Patent
LigandPNGBDBM432092(US10577330, Comparison Compound C1)
Affinity DataIC50:  2nM. Assay description: Recombinant human LAP (R&D Systems, 246-LP) diluted to 0.25 g/mL in TBS+ buffer (25 mM Tris pH 7.4, 137 mM NaCl, 2.7 mM KCl, 1 mM CaCl2, 1 mM MgCl2, ...
Ligand InfoPC cidPC sid
In DepthDetails US Patent
TargetIntegrin alpha-V/beta-3(Homo sapiens (Human))
Saint Louis University
US Patent
LigandPNGBDBM432092(US10577330, Comparison Compound C1)
Affinity DataIC50:  5nM. Assay description: Recombinant human vitronectin (R& D Systems, 2308-VN) diluted to 1 μg/mL in TBS+ buffer (25 mM Tris pH 7.4, 137 mM NaCl, 2.7 mM KCl, 1 mM CaCl2,...
Ligand InfoPC cidPC sid
In DepthDetails US Patent