BDBM432157 N-(1-Benzylpiperidin-4-yl)-5-chloro-N-(1-phenyl-1H-pyrazol-3-yl)thiophene-2-::US10577360, Example 23
SMILES Clc1ccc(s1)C(=O)N(C1CCN(Cc2ccccc2)CC1)c1ccn(n1)-c1ccccc1
InChI Key InChIKey=KCFATVFDJGUCIV-UHFFFAOYSA-N
Data  2 KI
  Tab Delimited (TSV)   2D SDfile   Computed 3D by Vconf -m prep SDfile
Find this compound or compounds like it in BindingDB:
Activity Spreadsheet -- Enzyme Inhibition Constant Data from BindingDB
Found 2 hits for monomerid = 432157
TargetMu-type opioid receptor(Homo sapiens (Human))
Esteve Pharmaceuticals
US Patent
LigandPNGBDBM432157(N-(1-Benzylpiperidin-4-yl)-5-chloro-N-(1-phenyl-1H...)
Affinity DataKi:  300nM. Assay description: To investigate binding properties of test compounds to human μ-opioid receptor, transfected CHO-K1 cell membranes and [3H]-DAMGO (Perkin Elmer, ...
Ligand InfoPC cidPC sid
In DepthDetails US Patent
TargetVoltage-dependent calcium channel subunit alpha-2/delta-1(Homo sapiens (Human))
Esteve Pharmaceuticals
US Patent
LigandPNGBDBM432157(N-(1-Benzylpiperidin-4-yl)-5-chloro-N-(1-phenyl-1H...)
Affinity DataKi: >5.00E+3nM. Assay description: Human α2δ-1 enriched membranes (2.5 μg) were incubated with 15 nM of radiolabeled [3H]-Gabapentin in assay buffer containing Hepes-KOH...
Ligand InfoPC cidPC sid
In DepthDetails US Patent