BDBM432269 N-[6-(4-Methoxyphenyl)pyrazin-2-yl]-N-(1-methylpiperidin-4-yl)thiophene-2-::US10577360, Example 132
SMILES COc1ccc(cc1)-c1cccc(n1)N(C1CCN(C)CC1)C(=O)c1cccs1
InChI Key InChIKey=JMFRWIXBZRDEAX-UHFFFAOYSA-N
Data  2 KI
  Tab Delimited (TSV)   2D SDfile   Computed 3D by Vconf -m prep SDfile
Find this compound or compounds like it in BindingDB:
Activity Spreadsheet -- Enzyme Inhibition Constant Data from BindingDB
Found 2 hits for monomerid = 432269
TargetMu-type opioid receptor(Homo sapiens (Human))
Esteve Pharmaceuticals
US Patent
LigandPNGBDBM432269(N-[6-(4-Methoxyphenyl)pyrazin-2-yl]-N-(1-methylpip...)
Affinity DataKi: <100nM. Assay description: To investigate binding properties of test compounds to human μ-opioid receptor, transfected CHO-K1 cell membranes and [3H]-DAMGO (Perkin Elmer, ...
Ligand InfoPC cidPC sid
In DepthDetails US Patent
TargetVoltage-dependent calcium channel subunit alpha-2/delta-1(Homo sapiens (Human))
Esteve Pharmaceuticals
US Patent
LigandPNGBDBM432269(N-[6-(4-Methoxyphenyl)pyrazin-2-yl]-N-(1-methylpip...)
Affinity DataKi: >5.00E+3nM. Assay description: Human α2δ-1 enriched membranes (2.5 μg) were incubated with 15 nM of radiolabeled [3H]-Gabapentin in assay buffer containing Hepes-KOH...
Ligand InfoPC cidPC sid
In DepthDetails US Patent