BDBM43282 5-[(5-chloro-2-methoxy-anilino)methyl]-4-methyl-2-thenoic acid::5-[(5-chloro-2-methoxyanilino)methyl]-4-methyl-2-thiophenecarboxylic acid::5-[(5-chloro-2-methoxyanilino)methyl]-4-methylthiophene-2-carboxylic acid::5-[[(5-chloranyl-2-methoxy-phenyl)amino]methyl]-4-methyl-thiophene-2-carboxylic acid::UNM000011081701::cid_20899532
SMILES COc1ccc(Cl)cc1NCc1sc(cc1C)C(O)=O
InChI Key InChIKey=YBNZEIMJKLUTGD-UHFFFAOYSA-N
Data  2 EC50
  Tab Delimited (TSV)   2D SDfile   Computed 3D by Vconf -m prep SDfile
Find this compound or compounds like it in BindingDB:
Activity Spreadsheet -- Enzyme Inhibition Constant Data from BindingDB
Found 2 hits for monomerid = 43282
LigandPNGBDBM43282(5-[(5-chloro-2-methoxy-anilino)methyl]-4-methyl-2-...)
Affinity DataEC50:  1.82E+3nM. Assay description: University of New Mexico Assay Overview: Assay Support: NIH I RO3 MH081231-01 HTS to identify specific small molecule inhibitors of Ras and Ras-rela...
In DepthDetails PCBioAssay
LigandPNGBDBM43282(5-[(5-chloro-2-methoxy-anilino)methyl]-4-methyl-2-...)
Affinity DataEC50:  2.19E+3nM. Assay description: University of New Mexico Assay Overview: Assay Support: NIH I RO3 MH081231-01 HTS to identify specific small molecule inhibitors of Ras and Ras-rela...
In DepthDetails PCBioAssay