BDBM432840 5-cyclopropyl-N-((1R,3r,5S)-8- ((piperidin-4-ylmethyl)sulfonyl)-8- azabicyclo[3.2.1]octan-3-yl)isoxazole-3- carboxamide::US10577363, Compound 543
SMILES O=C(N[C@@H]1C[C@@H]2CC[C@H](C1)N2S(=O)(=O)CC1CCNCC1)c1cc(on1)C1CC1
InChI Key InChIKey=BMPLIMIJVNBMHU-BJWYYQGGSA-N
Data  1 IC50
  Tab Delimited (TSV)   2D SDfile   Computed 3D by Vconf -m prep SDfile
Find this compound or compounds like it in BindingDB:
Activity Spreadsheet -- Enzyme Inhibition Constant Data from BindingDB
Found 1 hit for monomerid = 432840
TargetHistone-lysine N-methyltransferase SMYD3(Homo sapiens (Human))
Epizyme
US Patent
LigandPNGBDBM432840(5-cyclopropyl-N-((1R,3r,5S)-8- ((piperidin-4-ylmet...)
Affinity DataIC50:  1.80nM. Assay description: The assays were all performed in a buffer consisting of 25 mM Tris-Cl pH 8.0, 1 mM TCEP, 0.005% BSG, and 0.005% Tween 20, prepared on the day of use....
Ligand InfoPC cidPC sid
In DepthDetails US Patent