BDBM432841 N-((2S,4S)-1-(((1-benzylpiperidin-4- yl)methyl)sulfonyl)-2-methylpiperidin-4- yl)-5-cyclopropylisoxazole-3-carboxamide::US10577363, Compound 544
SMILES C[C@H]1C[C@H](CCN1S(=O)(=O)CC1CCN(Cc2ccccc2)CC1)NC(=O)c1cc(on1)C1CC1
InChI Key InChIKey=QUCHYRIFWBGWSF-CVDCTZTESA-N
Data  1 IC50
  Tab Delimited (TSV)   2D SDfile   Computed 3D by Vconf -m prep SDfile
Find this compound or compounds like it in BindingDB:
Activity Spreadsheet -- Enzyme Inhibition Constant Data from BindingDB
Found 1 hit for monomerid = 432841
TargetHistone-lysine N-methyltransferase SMYD3(Homo sapiens (Human))
Epizyme
US Patent
LigandPNGBDBM432841(N-((2S,4S)-1-(((1-benzylpiperidin-4- yl)methyl)sul...)
Affinity DataIC50:  1.90nM. Assay description: The assays were all performed in a buffer consisting of 25 mM Tris-Cl pH 8.0, 1 mM TCEP, 0.005% BSG, and 0.005% Tween 20, prepared on the day of use....
Ligand InfoPC cidPC sid
In DepthDetails US Patent