BDBM43299 2,5-dimethoxy-N-(4-methoxyphenyl)benzenesulfonamide::PC-0596527::PCMD-CC-MCM-210::cid_778388
SMILES COc1ccc(NS(=O)(=O)c2cc(OC)ccc2OC)cc1
InChI Key InChIKey=PEJWFRRHZJLUHK-UHFFFAOYSA-N
Data  1 IC50
  Tab Delimited (TSV)   2D SDfile   Computed 3D by Vconf -m prep SDfile
Find this compound or compounds like it in BindingDB:
Activity Spreadsheet -- Enzyme Inhibition Constant Data from BindingDB
Found 1 hit for monomerid = 43299
TargetDNA-directed RNA polymerase subunit beta(Escherichia coli)
Pcmd
Curated by PubChem BioAssay
LigandPNGBDBM43299(2,5-dimethoxy-N-(4-methoxyphenyl)benzenesulfonamid...)
Affinity DataIC50: >5.00E+4nM. Assay description: Screening Center: Penn Center for Molecular Discovery Center Affiliation: University of Pennsylvania Network: Molecular Library Screening Center Netw...
In DepthDetails PCBioAssay