BDBM433324 US10561657, Example 1
SMILES Nc1nn(cc1-c1ncnc2[nH]ccc12)C(CC#N)C1CCCC1
InChI Key
Data  2 IC50
  Tab Delimited (TSV)   2D SDfile   Computed 3D by Vconf -m prep SDfile
Find this compound or compounds like it in BindingDB:
Activity Spreadsheet -- Enzyme Inhibition Constant Data from BindingDB
Found 2 hits for monomerid = 433324
TargetTyrosine-protein kinase JAK2 [V617F](Homo sapiens (Human))
Centaurus Biophrama
US Patent
LigandPNGBDBM433324(US10561657, Example 1)
Affinity DataIC50: <20nM. Assay description: A testing platform for kinase activity of JAK2 (wild type and V617F mutant type) was established based on Homogeneous Time-Resolved Fluorescence (HTR...
Ligand InfoPC cidPC sid
In DepthDetails US Patent
TargetTyrosine-protein kinase JAK2(Homo sapiens (Human))
Centaurus Biophrama
US Patent
LigandPNGBDBM433324(US10561657, Example 1)
Affinity DataIC50: <20nM. Assay description: A testing platform for kinase activity of JAK2 (wild type and V617F mutant type) was established based on Homogeneous Time-Resolved Fluorescence (HTR...
Ligand InfoPC cidPC sid
In DepthDetails US Patent