BDBM433382 US10562850, Compound 64g::US11066360, Compound 64g
SMILES NC(CCC1CC1)(c1cccnc1)c1ccc(F)c(NC(=O)[C@H]2C[C@@H](O)CN2C(=O)Nc2ccc(Cl)cc2)c1
InChI Key InChIKey=GXRAZUOSZNNHEA-XATCSJPRSA-N
Data  2 KI
  Tab Delimited (TSV)   2D SDfile   Computed 3D by Vconf -m prep SDfile
Find this compound or compounds like it in BindingDB:
Activity Spreadsheet -- Enzyme Inhibition Constant Data from BindingDB
Found 2 hits for monomerid = 433382
TargetPlasma kallikrein(Homo sapiens (Human))
Biocryst Pharmaceuticals
US Patent
LigandPNGBDBM433382(US10562850, Compound 64g | US11066360, Compound 64...)
Affinity DataKi: <50nM. Assay description: The effect of compounds of the invention on human plasma kallikrein activity was determined using the chromogenic substrates (DiaPharma Group, Inc., ...
Ligand InfoPC cidPC sid
In DepthDetails US Patent
TargetPlasma kallikrein(Homo sapiens (Human))
Biocryst Pharmaceuticals
US Patent
LigandPNGBDBM433382(US10562850, Compound 64g | US11066360, Compound 64...)
Affinity DataKi: <50nM. Assay description: The effect of compounds of the invention on human plasma kallikrein activity was determined using the chromogenic substrates. In these experiments, 2...
Ligand InfoPC cidPC sid
In DepthDetails US Patent