BDBM43367 (5,6-Dimethyl-benzoimidazol-1-yl)-(4-methyl-piperidin-1-yl)-methanone::(5,6-dimethyl-1-benzimidazolyl)-(4-methyl-1-piperidinyl)methanone::(5,6-dimethylbenzimidazol-1-yl)-(4-methylpiperidin-1-yl)methanone::(5,6-dimethylbenzimidazol-1-yl)-(4-methylpiperidino)methanone::MLS000528358::SMR000120933::cid_888939
SMILES CC1CCN(CC1)C(=O)n1cnc2cc(C)c(C)cc12
InChI Key InChIKey=VOWBZMVBYGELAY-UHFFFAOYSA-N
Data  1 EC50
  Tab Delimited (TSV)   2D SDfile   Computed 3D by Vconf -m prep SDfile
Find this compound or compounds like it in BindingDB:
Activity Spreadsheet -- Enzyme Inhibition Constant Data from BindingDB
Found 1 hit for monomerid = 43367
TargetE3 ubiquitin-protein ligase Mdm2(Homo sapiens (Human))
Pcmd
Curated by PubChem BioAssay
LigandPNGBDBM43367((5,6-Dimethyl-benzoimidazol-1-yl)-(4-methyl-piperi...)
Affinity DataEC50:  1.29E+6nM. Assay description: Molecular Library Screening Center Network (MLSCN) Penn Center for Molecular Discovery (PCMD) Assay Provider: Brent Stockwell, Columbia University ML...
In DepthDetails PCBioAssay