BDBM43407 4-(3,4-dihydro-2H-quinolin-1-ylsulfonyl)-N-[3-(2-methoxyethyl)-6-methylsulfonyl-1,3-benzothiazol-2-ylidene]benzamide::4-(3,4-dihydro-2H-quinolin-1-ylsulfonyl)-N-[6-mesyl-3-(2-methoxyethyl)-1,3-benzothiazol-2-ylidene]benzamide::MLS000697098::SMR000237856::cid_4133680
SMILES COCCn1c2ccc(cc2s\c1=N\C(=O)c1ccc(cc1)S(=O)(=O)N1CCCc2ccccc12)S(C)(=O)=O
InChI Key InChIKey=LCADPBIUWURBPW-BYYHNAKLSA-N
Data  1 EC50
  Tab Delimited (TSV)   2D SDfile   Computed 3D by Vconf -m prep SDfile
Find this compound or compounds like it in BindingDB:
Activity Spreadsheet -- Enzyme Inhibition Constant Data from BindingDB
Found 1 hit for monomerid = 43407
TargetE3 ubiquitin-protein ligase Mdm2(Homo sapiens (Human))
Pcmd
Curated by PubChem BioAssay
LigandPNGBDBM43407(4-(3,4-dihydro-2H-quinolin-1-ylsulfonyl)-N-[3-(2-m...)
Affinity DataEC50:  1.03E+3nM. Assay description: Molecular Library Screening Center Network (MLSCN) Penn Center for Molecular Discovery (PCMD) Assay Provider: Brent Stockwell, Columbia University ML...
In DepthDetails PCBioAssay