BDBM43410 MLS000720375::N-(1,3-benzodioxol-5-yl)-2-[[3-(4-methoxyphenyl)-1,2,4-thiadiazol-5-yl]sulfanyl]acetamide::N-(1,3-benzodioxol-5-yl)-2-[[3-(4-methoxyphenyl)-1,2,4-thiadiazol-5-yl]sulfanyl]ethanamide::N-(1,3-benzodioxol-5-yl)-2-[[3-(4-methoxyphenyl)-1,2,4-thiadiazol-5-yl]thio]acetamide::SMR000236298::cid_5066968
SMILES COc1ccc(cc1)-c1nsc(SCC(=O)Nc2ccc3OCOc3c2)n1
InChI Key InChIKey=DTRMPGOCLNBTDM-UHFFFAOYSA-N
Data  1 EC50
  Tab Delimited (TSV)   2D SDfile   Computed 3D by Vconf -m prep SDfile
Find this compound or compounds like it in BindingDB:
Activity Spreadsheet -- Enzyme Inhibition Constant Data from BindingDB
Found 1 hit for monomerid = 43410
TargetE3 ubiquitin-protein ligase Mdm2(Homo sapiens (Human))
Pcmd
Curated by PubChem BioAssay
LigandPNGBDBM43410(MLS000720375 | N-(1,3-benzodioxol-5-yl)-2-[[3-(4-m...)
Affinity DataEC50:  190nM. Assay description: Molecular Library Screening Center Network (MLSCN) Penn Center for Molecular Discovery (PCMD) Assay Provider: Brent Stockwell, Columbia University ML...
In DepthDetails PCBioAssay