BDBM43429 2,2,6-trimethyl-1-benzothiopyran 1-oxide::2,2,6-trimethyl-2H-thiochromene 1-oxide::2,2,6-trimethylthiochromene 1-oxide::MLS000703871::SMR000227073::cid_4143337
SMILES Cc1ccc2c(C=CC(C)(C)S2=O)c1
InChI Key InChIKey=OWRDGESCAWHHGA-UHFFFAOYSA-N
Data  1 EC50
  Tab Delimited (TSV)   2D SDfile   Computed 3D by Vconf -m prep SDfile
Find this compound or compounds like it in BindingDB:
Activity Spreadsheet -- Enzyme Inhibition Constant Data from BindingDB
Found 1 hit for monomerid = 43429
TargetE3 ubiquitin-protein ligase Mdm2(Homo sapiens (Human))
Pcmd
Curated by PubChem BioAssay
LigandPNGBDBM43429(2,2,6-trimethyl-1-benzothiopyran 1-oxide | 2,2,6-t...)
Affinity DataEC50:  1.17E+6nM. Assay description: Molecular Library Screening Center Network (MLSCN) Penn Center for Molecular Discovery (PCMD) Assay Provider: Brent Stockwell, Columbia University ML...
Ligand InfoPC cidPC sid
In DepthDetails PCBioAssay