BDBM43442 2-[4-(5-methyl-2-phenyl-2-pyrazolin-3-yl)phenoxy]acetic acid ethyl ester::2-[4-(5-methyl-2-phenyl-3,4-dihydropyrazol-3-yl)phenoxy]acetic acid ethyl ester::MLS000727630::SMR000306327::cid_6620926::ethyl 2-[4-(5-methyl-2-phenyl-3,4-dihydropyrazol-3-yl)phenoxy]acetate::ethyl 2-[4-(5-methyl-2-phenyl-3,4-dihydropyrazol-3-yl)phenoxy]ethanoate::ethyl [4-(3-methyl-1-phenyl-4,5-dihydro-1H-pyrazol-5-yl)phenoxy]acetate
SMILES CCOC(=O)COc1ccc(cc1)C1CC(C)=NN1c1ccccc1
InChI Key InChIKey=RXCVAYSJNKDUCI-UHFFFAOYSA-N
Data  1 EC50
  Tab Delimited (TSV)   2D SDfile   Computed 3D by Vconf -m prep SDfile
Find this compound or compounds like it in BindingDB:
Activity Spreadsheet -- Enzyme Inhibition Constant Data from BindingDB
Found 1 hit for monomerid = 43442
TargetE3 ubiquitin-protein ligase Mdm2(Homo sapiens (Human))
Pcmd
Curated by PubChem BioAssay
LigandPNGBDBM43442(2-[4-(5-methyl-2-phenyl-2-pyrazolin-3-yl)phenoxy]a...)
Affinity DataEC50:  5.18E+6nM. Assay description: Molecular Library Screening Center Network (MLSCN) Penn Center for Molecular Discovery (PCMD) Assay Provider: Brent Stockwell, Columbia University ML...
In DepthDetails PCBioAssay