BDBM434536 US10562900, Example 14
SMILES COc1cc(OC)c(Cl)c(c1Cl)-c1ccc2c(NC(=O)c3ccc(cc3)N3C[C@H](C)N[C@H](C)C3)n[nH]c2c1
InChI Key
Data  4 IC50
  Tab Delimited (TSV)   2D SDfile   Computed 3D by Vconf -m prep SDfile
Find this compound or compounds like it in BindingDB:
Activity Spreadsheet -- Enzyme Inhibition Constant Data from BindingDB
Found 4 hits for monomerid = 434536
TargetVascular endothelial growth factor receptor 2(Homo sapiens (Human))
Shanghai Haihe Pharmaceutical
US Patent
LigandPNGBDBM434536(US10562900, Example 14)
Affinity DataIC50: <200nM. Assay description: The enzyme reaction substrate Poly(Glu,Tyr) 4:1 was diluted with PBS without potassium ion (10 mM sodium phosphate buffer, 150 mM NaCl, pH7.2-7.4) to...
Ligand InfoPC cidPC sid
In DepthDetails US Patent
TargetFibroblast growth factor receptor 3(Homo sapiens (Human))
Shanghai Haihe Pharmaceutical
US Patent
LigandPNGBDBM434536(US10562900, Example 14)
Affinity DataIC50: <100nM. Assay description: The enzyme reaction substrate Poly(Glu,Tyr) 4:1 was diluted with PBS without potassium ion (10 mM sodium phosphate buffer, 150 mM NaCl, pH7.2-7.4) to...
Ligand InfoPC cidPC sid
In DepthDetails US Patent
TargetFibroblast growth factor receptor 2(Homo sapiens (Human))
Shanghai Haihe Pharmaceutical
US Patent
LigandPNGBDBM434536(US10562900, Example 14)
Affinity DataIC50: <100nM. Assay description: The enzyme reaction substrate Poly(Glu,Tyr) 4:1 was diluted with PBS without potassium ion (10 mM sodium phosphate buffer, 150 mM NaCl, pH7.2-7.4) to...
Ligand InfoPC cidPC sid
In DepthDetails US Patent
TargetFibroblast growth factor receptor 1(Homo sapiens (Human))
Shanghai Haihe Pharmaceutical
US Patent
LigandPNGBDBM434536(US10562900, Example 14)
Affinity DataIC50: <100nM. Assay description: The enzyme reaction substrate Poly(Glu,Tyr) 4:1 was diluted with PBS without potassium ion (10 mM sodium phosphate buffer, 150 mM NaCl, pH7.2-7.4) to...
Ligand InfoPC cidPC sid
In DepthDetails US Patent