BDBM43458 MLS000678468::N-cyclopentyl-2-[6-(furan-2-yl)pyridazin-3-yl]sulfanyl-ethanamide::N-cyclopentyl-2-[6-(furan-2-yl)pyridazin-3-yl]sulfanylacetamide::N-cyclopentyl-2-[[6-(2-furanyl)-3-pyridazinyl]thio]acetamide::N-cyclopentyl-2-[[6-(2-furyl)pyridazin-3-yl]thio]acetamide::SMR000323945::cid_7207106
SMILES O=C(CSc1ccc(nn1)-c1ccco1)NC1CCCC1
InChI Key InChIKey=NDAJURCJZUVTDG-UHFFFAOYSA-N
Data  1 EC50
  Tab Delimited (TSV)   2D SDfile   Computed 3D by Vconf -m prep SDfile
Find this compound or compounds like it in BindingDB:
Activity Spreadsheet -- Enzyme Inhibition Constant Data from BindingDB
Found 1 hit for monomerid = 43458
TargetE3 ubiquitin-protein ligase Mdm2(Homo sapiens (Human))
Pcmd
Curated by PubChem BioAssay
LigandPNGBDBM43458(MLS000678468 | N-cyclopentyl-2-[6-(furan-2-yl)pyri...)
Affinity DataEC50:  750nM. Assay description: Molecular Library Screening Center Network (MLSCN) Penn Center for Molecular Discovery (PCMD) Assay Provider: Brent Stockwell, Columbia University ML...
In DepthDetails PCBioAssay