BDBM434613 US10562902, Compound 19
SMILES Cc1cc(Nc2nc(N[C@@H]3C[C@H](CO)[C@@H](O)[C@H]3O)c3n(ccc3n2)-c2cnn(C)c2)sn1
InChI Key InChIKey=CLQWSVAMHHSRDW-DGWLBADLSA-N
Data  1 IC50
  Tab Delimited (TSV)   2D SDfile   Computed 3D by Vconf -m prep SDfile
Find this compound or compounds like it in BindingDB:
Activity Spreadsheet -- Enzyme Inhibition Constant Data from BindingDB
Found 1 hit for monomerid = 434613
TargetInterleukin-1 receptor-associated kinase 4(Homo sapiens (Human))
Beijing Hanmi Pharmaceutical
US Patent
LigandPNGBDBM434613(US10562902, Compound 19)
Affinity DataIC50: <100nM. Assay description: IRAK4 kinase (purchased from Life Technologies, Cat. No.: PR5612U) was diluted to 2 folds of the final concentration (the final concentration is 0.76...
Ligand InfoPC cidPC sid
In DepthDetails US Patent