BDBM434733 US10562902, Compound 139
SMILES COCCNC(=O)c1csc(Nc2nc(O[C@@H]3CCOC3)c3n(ccc3n2)-c2cnn(C)c2)c1
InChI Key InChIKey=XQSLGSMFLMCUGB-MRXNPFEDSA-N
Data  1 IC50
  Tab Delimited (TSV)   2D SDfile   Computed 3D by Vconf -m prep SDfile
Find this compound or compounds like it in BindingDB:
Activity Spreadsheet -- Enzyme Inhibition Constant Data from BindingDB
Found 1 hit for monomerid = 434733
TargetInterleukin-1 receptor-associated kinase 4(Homo sapiens (Human))
Beijing Hanmi Pharmaceutical
US Patent
LigandPNGBDBM434733(US10562902, Compound 139)
Affinity DataIC50: <100nM. Assay description: IRAK4 kinase (purchased from Life Technologies, Cat. No.: PR5612U) was diluted to 2 folds of the final concentration (the final concentration is 0.76...
Ligand InfoPC cidPC sid
In DepthDetails US Patent