BDBM434750 US10562902, Compound 156
SMILES CCNC(=O)c1cc(Nc2nc(OCCOC)c3n(ccc3n2)-c2cnn(C)c2)ss1
InChI Key
Data  1 IC50
  Tab Delimited (TSV)   2D SDfile   Computed 3D by Vconf -m prep SDfile
Find this compound or compounds like it in BindingDB:
Activity Spreadsheet -- Enzyme Inhibition Constant Data from BindingDB
Found 1 hit for monomerid = 434750
TargetInterleukin-1 receptor-associated kinase 4(Homo sapiens (Human))
Beijing Hanmi Pharmaceutical
US Patent
LigandPNGBDBM434750(US10562902, Compound 156)
Affinity DataIC50: <100nM. Assay description: IRAK4 kinase (purchased from Life Technologies, Cat. No.: PR5612U) was diluted to 2 folds of the final concentration (the final concentration is 0.76...
Ligand InfoPC cidPC sid
In DepthDetails US Patent