BDBM434764 US10562902, Compound 170
SMILES Cn1cc(cn1)-n1ccc2nc(Nc3cc(cs3)C(=O)NCC(F)F)nc(OC3CCOCC3)c12
InChI Key InChIKey=ALMRPMJYTIVEPD-UHFFFAOYSA-N
Data  1 IC50
  Tab Delimited (TSV)   2D SDfile   Computed 3D by Vconf -m prep SDfile
Find this compound or compounds like it in BindingDB:
Activity Spreadsheet -- Enzyme Inhibition Constant Data from BindingDB
Found 1 hit for monomerid = 434764
TargetInterleukin-1 receptor-associated kinase 4(Homo sapiens (Human))
Beijing Hanmi Pharmaceutical
US Patent
LigandPNGBDBM434764(US10562902, Compound 170)
Affinity DataIC50: <100nM. Assay description: IRAK4 kinase (purchased from Life Technologies, Cat. No.: PR5612U) was diluted to 2 folds of the final concentration (the final concentration is 0.76...
Ligand InfoPC cidPC sid
In DepthDetails US Patent